Target
D(2) dopamine receptor
Ligand
BDBM50159175
Substrate
Meas. Tech.
ChEMBL_303626 (CHEMBL828837)
Ki
>5000±n/a nM
Citation
 Cole, DCLennox, WJLombardi, SEllingboe, JWBernotas, RCTawa, GJMazandarani, HSmith, DLZhang, GCoupet, JSchechter, LE Discovery of 5-arylsulfonamido-3-(pyrrolidin-2-ylmethyl)-1H-indole derivatives as potent, selective 5-HT6 receptor agonists and antagonists. J Med Chem 48:353-6 (2005)  
Target
Name:
D(2) dopamine receptor
Synonyms:
D(2) dopamine receptor DOPAMINE D2 Long DRD2 Dopamine D2 receptor Dopamine D2 receptor (D2R) Dopamine2-like | d2
Type:
Cell-surface receptors
Mol. Mass.:
50647.10
Organism:
Homo sapiens (Human)
Description:
P14416
Residue:
443
  
Inhibitor
Name:
BDBM50159175
Synonyms:
2-Chloro-N-(3-(R)-1-pyrrolidin-2-ylmethyl-1H-indol-5-yl)-benzenesulfonamide
Type:
Small organic molecule
Emp. Form.:
C19H20ClN3O2S
Mol. Mass.:
389.899
SMILES:
Clc1ccccc1S(=O)(=O)Nc1ccc2[nH]cc(CC3CCCN3)c2c1
: