Target
5-hydroxytryptamine receptor 1D
Ligand
BDBM50159175
Substrate
Meas. Tech.
ChEMBL_303710 (CHEMBL829045)
Ki
>1000±n/a nM
Citation
 Cole, DCLennox, WJLombardi, SEllingboe, JWBernotas, RCTawa, GJMazandarani, HSmith, DLZhang, GCoupet, JSchechter, LE Discovery of 5-arylsulfonamido-3-(pyrrolidin-2-ylmethyl)-1H-indole derivatives as potent, selective 5-HT6 receptor agonists and antagonists. J Med Chem 48:353-6 (2005)  
Target
Name:
5-hydroxytryptamine receptor 1D
Synonyms:
5-HT-1D 5-HT1D 5HT1D_HUMAN HTR1DA Serotonin (5-HT) receptor | Serotonin Receptor 1D
Type:
G Protein-Coupled Receptor (GPCR)
Mol. Mass.:
41920.63
Organism:
Homo sapiens (Human)
Description:
Receptor binding assays were performed using human clone stably expressed in CHO cells.
Residue:
377
  
Inhibitor
Name:
BDBM50159175
Synonyms:
2-Chloro-N-(3-(R)-1-pyrrolidin-2-ylmethyl-1H-indol-5-yl)-benzenesulfonamide
Type:
Small organic molecule
Emp. Form.:
C19H20ClN3O2S
Mol. Mass.:
389.899
SMILES:
Clc1ccccc1S(=O)(=O)Nc1ccc2[nH]cc(CC3CCCN3)c2c1
: