Target
Transporter
Ligand
BDBM50083536
Substrate
Meas. Tech.
ChEMBL_302810 (CHEMBL838518)
Ki
74500±n/a nM
Citation
 Lomenzo, SARhoden, JBIzenwasser, SWade, DKopajtic, TKatz, JLTrudell, ML Synthesis and biological evaluation of meperidine analogues at monoamine transporters. J Med Chem 48:1336-43 (2005)  
Target
Name:
Transporter
Synonyms:
Monoamine transporters; Norepininephrine & dopamine | Norepinephrine Monoamine transporters
Type:
PROTEIN
Mol. Mass.:
66787.87
Organism:
Rattus norvegicus
Description:
ChEMBL_1463061
Residue:
597
  
Inhibitor
Name:
BDBM50083536
Synonyms:
4-(3,4-Dichloro-phenyl)-1-methyl-piperidine-4-carboxylic acid ethyl ester CHEMBL541124
Type:
Small organic molecule
Emp. Form.:
C15H19Cl2NO2
Mol. Mass.:
316.223
SMILES:
CCOC(=O)C1(CCN(C)CC1)c1ccc(Cl)c(Cl)c1
: