Target
Mu-type opioid receptor
Ligand
BDBM50083531
Substrate
Meas. Tech.
ChEMBL_302974 (CHEMBL827953)
Ki
17300±n/a nM
Citation
 Lomenzo, SARhoden, JBIzenwasser, SWade, DKopajtic, TKatz, JLTrudell, ML Synthesis and biological evaluation of meperidine analogues at monoamine transporters. J Med Chem 48:1336-43 (2005)  
Target
Name:
Mu-type opioid receptor
Synonyms:
M-OR-1 MOR-1 MUOR1 Mu opiate receptor OPRM1 hMOP | mu-type opioid receptor isoform MOR-1
Type:
G Protein-Coupled Receptor (GPCR)
Mol. Mass.:
44789.51
Organism:
Homo sapiens (Human)
Description:
P35372
Residue:
400
  
Inhibitor
Name:
BDBM50083531
Synonyms:
4-(4-Iodo-phenyl)-1-methyl-piperidine-4-carbonitrile CHEMBL536037
Type:
Small organic molecule
Emp. Form.:
C13H15IN2
Mol. Mass.:
326.1761
SMILES:
CN1CCC(CC1)(C#N)c1ccc(I)cc1
: