Target
Carbonic anhydrase 2
Ligand
BDBM13057
Substrate
Meas. Tech.
ChEMBL_303314 (CHEMBL840040)
Ki
12.0±n/a nM
Citation
 Maryanoff, BEMcComsey, DFCostanzo, MJHochman, CSmith-Swintosky, VShank, RP Comparison of sulfamate and sulfamide groups for the inhibition of carbonic anhydrase-II by using topiramate as a structural platform. J Med Chem 48:1941-7 (2005)  
Target
Name:
Carbonic anhydrase 2
Synonyms:
CA-II CAC Carbonate dehydratase II Carbonic anhydrase 2 (CA-II) Carbonic anhydrase C Carbonic anhydrase II (CA-II) Carbonic anhydrase II (hCA II) | Carbonic anhydrase isoenzyme II (hCA II)
Type:
Enzyme
Mol. Mass.:
29250.71
Organism:
Homo sapiens (Human)
Description:
P00918
Residue:
260
  
Inhibitor
Name:
BDBM13057
Synonyms:
CHEMBL417656 Cyclic Sulfate Analogue of Topiramate [(1S,2S,6R,9S)-11,11-dimethyl-4,4-dioxo-3,5,8,10,12-pentaoxa-4-thiatricyclo[7.3.0.0^{2,6}]dodecan-9-yl]methyl sulfamate | [(3aR,5aS,8aS,8bS)-7,7-dimethyl-2,2-dioxidotetrahydro-5aH-[1,3,2]dioxathiolo[4,5-d][1,3]dioxolo[4,5-b]pyran-5a-yl]methyl sulfamate
Type:
Small organic molecule
Emp. Form.:
C9H15NO10S2
Mol. Mass.:
361.346
SMILES:
CC1(C)O[C@H]2[C@@H]3OS(=O)(=O)O[C@@H]3CO[C@@]2(COS(N)(=O)=O)O1
: