Target
Sodium-dependent dopamine transporter
Ligand
BDBM50366775
Substrate
Meas. Tech.
ChEMBL_305802 (CHEMBL827990)
IC50
118±n/a nM
Citation
 Simoni, DRossi, MBertolasi, VRoberti, MPizzirani, DRondanin, RBaruchello, RInvidiata, FPTolomeo, MGrimaudo, SMerighi, SVarani, KGessi, SBorea, PAMarino, SCavallini, SBianchi, CSiniscalchi, A Synthesis and pharmacology of 6-substituted benztropines: discovery of novel dopamine uptake inhibitors possessing low binding affinity to the dopamine transporter. J Med Chem 48:3337-43 (2005)  
Target
Name:
Sodium-dependent dopamine transporter
Synonyms:
DA transporter SC6A3_RAT Sodium-dependent dopamine transporter | Sodium-dependent dopamine transporter (DAT)
Type:
Multi-pass membrane protein
Mol. Mass.:
68749.45
Organism:
Rattus norvegicus (rat)
Description:
P23977
Residue:
619
  
Inhibitor
Name:
BDBM50366775
Synonyms:
BENZTROPINE | Benzatropine
Type:
Small organic molecule
Emp. Form.:
C21H25NO
Mol. Mass.:
307.4293
SMILES:
CN1[C@H]2CC[C@@H]1C[C@@H](C2)OC(c1ccccc1)c1ccccc1
: