Target
Mu-type opioid receptor
Ligand
BDBM50166214
Substrate
Meas. Tech.
ChEMBL_303276 (CHEMBL828270)
Ki
0.18±n/a nM
Citation
 Lattanzi, RSpetea, MSchüllner, FRief, SBKrassnig, RNegri, LSchmidhammer, H Synthesis and biological evaluation of 14-alkoxymorphinans. 22.(1) Influence of the 14-alkoxy group and the substitution in position 5 in 14-alkoxymorphinan-6-ones on in vitro and in vivo activities. J Med Chem 48:3372-8 (2005)  
Target
Name:
Mu-type opioid receptor
Synonyms:
MOR-1 Mu-type opioid receptor (MOR) OPRM_RAT Opioid receptor B Ror-b
Type:
G Protein-Coupled Receptor (GPCR)
Mol. Mass.:
44503.11
Organism:
Rattus norvegicus (rat)
Description:
Competition binding assays were carried out using membrane preparations from transfected HN9.10 cells that constitutively expressed the mu opioid receptor.
Residue:
398
  
Inhibitor
Name:
BDBM50166214
Synonyms:
10-hydroxy-4-methyl-17-(1-naphthylmethoxy)-(13R,17S)-12-oxa-4-azapentacyclo[9.6.1.01,13.05,17.07,18]octadeca-7(18),8,10-trien-14-one
Type:
Small organic molecule
Emp. Form.:
C28H27NO4
Mol. Mass.:
441.5183
SMILES:
CN1CC[C@@]23[C@H]4Oc5c2c(CC1[C@@]3(CCC4=O)OCc1cccc2ccccc12)ccc5O
: