Target
Peroxisome proliferator-activated receptor gamma
Ligand
BDBM50109547
Substrate
Meas. Tech.
ChEMBL_320735 (CHEMBL881208)
Kd
170±n/a nM
Citation
 Morphy, RRankovic, Z Designed multiple ligands. An emerging drug discovery paradigm. J Med Chem 48:6523-43 (2005)  
Target
Name:
Peroxisome proliferator-activated receptor gamma
Synonyms:
NR1C3 PPAR-gamma PPARG_HUMAN Peroxisome proliferator-activated receptor gamma (PPAR gamma) Peroxisome proliferator-activated receptor gamma (PPARĪ³) peroxisome proliferator-activated receptor gamma isoform 2
Type:
Nuclear Receptor
Mol. Mass.:
57613.46
Organism:
Homo sapiens (Human)
Description:
P37231
Residue:
505
  
Inhibitor
Name:
BDBM50109547
Synonyms:
(S)-3-(4-(2-CARBAZOL-9-YL-ETHOXY)-PHENYL)-2-ETHOXY-PROPIONIC ACID 3-[4-(2-Carbazol-9-yl-ethoxy)-phenyl]-2-ethoxy-propionic acid | CHEMBL86658
Type:
Small organic molecule
Emp. Form.:
C25H25NO4
Mol. Mass.:
403.4703
SMILES:
CCO[C@@H](Cc1ccc(OCCn2c3ccccc3c3ccccc23)cc1)C(O)=O
: