Target
C-C chemokine receptor type 1
Ligand
BDBM50174718
Substrate
Meas. Tech.
ChEMBL_325888 (CHEMBL863245)
IC50
6±n/a nM
Citation
 Revesz, LBollbuck, BBuhl, TEder, JEsser, RFeifel, RHeng, RHiestand, PJachez-Demange, BLoetscher, PSparrer, HSchlapbach, AWaelchli, R Novel CCR1 antagonists with oral activity in the mouse collagen induced arthritis. Bioorg Med Chem Lett 15:5160-4 (2005)  
Target
Name:
C-C chemokine receptor type 1
Synonyms:
C-C CKR-1 CC-CKR-1 CCR1 CD_antigen=CD191 CMKR1 LD78 receptor Macrophage inflammatory protein 1-alpha receptor SCYAR1
Type:
Enzyme
Mol. Mass.:
41180.69
Organism:
Homo sapiens (Human)
Description:
P32246
Residue:
355
  
Inhibitor
Name:
BDBM50174718
Synonyms:
CHEMBL200680 | N-(6-(3-(3-(4-fluorobenzyl)-3,8-diaza-bicyclo[3.2.1]octan-8-yl)-3-oxoprop-1-enyl)quinolin-7-yl)acetamide
Type:
Small organic molecule
Emp. Form.:
C27H27FN4O2
Mol. Mass.:
458.5273
SMILES:
CC(=O)Nc1cc2ncccc2cc1\C=C\C(=O)N1C2CCC1CN(Cc1ccc(F)cc1)C2
: