Target
5-hydroxytryptamine receptor 2A
Ligand
BDBM50174000
Substrate
Meas. Tech.
ChEMBL_326847 (CHEMBL860442)
Ki
14±n/a nM
Citation
 Arora, JBordeleau, MDube, LJarvie, KMazzocco, LPeragine, JTehim, AEgle, I N-[(3S)-1-benzylpyrrolidin-3-yl]-(2-thienyl)benzamides: human dopamine D4 ligands with high affinity for the 5-HT2A receptor. Bioorg Med Chem Lett 15:5253-6 (2005)  
Target
Name:
5-hydroxytryptamine receptor 2A
Synonyms:
5-HT-2 5-HT2A 5-hydroxytryptamine receptor 2A (5HT-2A) 5HT2A_HUMAN HTR2A | Serotonin receptor 2A
Type:
undefined
Mol. Mass.:
52607.65
Organism:
Homo sapiens (Human)
Description:
P28223
Residue:
471
  
Inhibitor
Name:
BDBM50174000
Synonyms:
(S)-N-(1-(4-fluorobenzyl)pyrrolidin-3-yl)-4-(thiophen-2-yl)benzamide | CHEMBL370823
Type:
Small organic molecule
Emp. Form.:
C22H21FN2OS
Mol. Mass.:
380.478
SMILES:
Fc1ccc(CN2CC[C@@H](C2)NC(=O)c2ccc(cc2)-c2cccs2)cc1
: