Target
D(2) dopamine receptor
Ligand
BDBM50174002
Substrate
Meas. Tech.
ChEMBL_326849 (CHEMBL860444)
Ki
1300±n/a nM
Citation
 Arora, JBordeleau, MDube, LJarvie, KMazzocco, LPeragine, JTehim, AEgle, I N-[(3S)-1-benzylpyrrolidin-3-yl]-(2-thienyl)benzamides: human dopamine D4 ligands with high affinity for the 5-HT2A receptor. Bioorg Med Chem Lett 15:5253-6 (2005)  
Target
Name:
D(2) dopamine receptor
Synonyms:
D(2) dopamine receptor DOPAMINE D2 Long DRD2 Dopamine D2 receptor Dopamine D2 receptor (D2R) Dopamine2-like | d2
Type:
Cell-surface receptors
Mol. Mass.:
50647.10
Organism:
Homo sapiens (Human)
Description:
P14416
Residue:
443
  
Inhibitor
Name:
BDBM50174002
Synonyms:
CHEMBL370652 | N-((S)-1-(4-(trifluoromethyl)benzyl)pyrrolidin-3-yl)-3-(thiophen-2-yl)benzamide
Type:
Small organic molecule
Emp. Form.:
C23H21F3N2OS
Mol. Mass.:
430.486
SMILES:
FC(F)(F)c1ccc(CN2CC[C@@H](C2)NC(=O)c2cccc(c2)-c2cccs2)cc1
: