Target
D(4) dopamine receptor
Ligand
BDBM50174003
Substrate
Meas. Tech.
ChEMBL_326846 (CHEMBL860441)
Ki
14±n/a nM
Citation
 Arora, JBordeleau, MDube, LJarvie, KMazzocco, LPeragine, JTehim, AEgle, I N-[(3S)-1-benzylpyrrolidin-3-yl]-(2-thienyl)benzamides: human dopamine D4 ligands with high affinity for the 5-HT2A receptor. Bioorg Med Chem Lett 15:5253-6 (2005)  
Target
Name:
D(4) dopamine receptor
Synonyms:
D(2C) dopamine receptor DOPAMINE D4.2 DRD4 Dopamine D4 receptor
Type:
Enzyme
Mol. Mass.:
48373.19
Organism:
Homo sapiens (Human)
Description:
P21917
Residue:
419
  
Inhibitor
Name:
BDBM50174003
Synonyms:
(S)-N-(1-(3-methoxybenzyl)pyrrolidin-3-yl)-4-(thiophen-2-yl)benzamide | CHEMBL427555
Type:
Small organic molecule
Emp. Form.:
C23H24N2O2S
Mol. Mass.:
392.514
SMILES:
COc1cccc(CN2CC[C@@H](C2)NC(=O)c2ccc(cc2)-c2cccs2)c1
: