Target
Muscarinic acetylcholine receptor M2
Ligand
BDBM50176717
Substrate
Meas. Tech.
ChEMBL_327856 (CHEMBL863986)
Ki
25±n/a nM
Citation
 Starck, JPTalaga, PQuéré, LCollart, PChristophe, BLo Brutto, PJadot, SChimmanamada, DZanda, MWagner, AMioskowski, CMassingham, RGuyaux, M Potent anti-muscarinic activity in a novel series of quinuclidine derivatives. Bioorg Med Chem Lett 16:373-7 (2005)  
Target
Name:
Muscarinic acetylcholine receptor M2
Synonyms:
ACM2_HUMAN Cholinergic, muscarinic M2 Muscarinic acetylcholine receptor M2 and M5 | RecName: Full=Muscarinic acetylcholine receptor M2
Type:
GPCR
Mol. Mass.:
51730.61
Organism:
Homo sapiens (Human)
Description:
P08172
Residue:
466
  
Inhibitor
Name:
BDBM50176717
Synonyms:
1-(3-methoxyquinuclidin-3-yl)-3-phenylhept-1-yn-3-ol | CHEMBL200416
Type:
Small organic molecule
Emp. Form.:
C21H29NO2
Mol. Mass.:
327.4605
SMILES:
CCCCC(O)(C#CC1(CN2CCC1CC2)OC)c1ccccc1
: