Target
Cannabinoid receptor 1
Ligand
BDBM50175120
Substrate
Meas. Tech.
ChEMBL_328732 (CHEMBL863907)
Ki
400±n/a nM
Citation
 Urbani, PCavallo, PCascio, MGBuonerba, MDe Martino, GDi Marzo, VSaturnino, C New metabolically stable fatty acid amide ligands of cannabinoid receptors: Synthesis and receptor affinity studies. Bioorg Med Chem Lett 16:138-41 (2005)  
Target
Name:
Cannabinoid receptor 1
Synonyms:
CANN6 CB-R CNR CNR1_HUMAN Cannabinoid receptor Cannabinoid receptor 1 (brain)
Type:
G Protein-Coupled Receptor (GPCR)
Mol. Mass.:
52868.96
Organism:
Homo sapiens (Human)
Description:
P21554
Residue:
472
  
Inhibitor
Name:
BDBM50175120
Synonyms:
CHEMBL199702 | N-(4-methoxyphenethyl)oleamide
Type:
Small organic molecule
Emp. Form.:
C27H45NO2
Mol. Mass.:
415.6517
SMILES:
CCCCCCCC\C=C/CCCCCCCC(=O)NCCc1ccc(OC)cc1
: