Target
Cannabinoid receptor 1
Ligand
BDBM50175130
Substrate
Meas. Tech.
ChEMBL_328732 (CHEMBL863907)
Ki
2800±n/a nM
Citation
 Urbani, PCavallo, PCascio, MGBuonerba, MDe Martino, GDi Marzo, VSaturnino, C New metabolically stable fatty acid amide ligands of cannabinoid receptors: Synthesis and receptor affinity studies. Bioorg Med Chem Lett 16:138-41 (2005)  
Target
Name:
Cannabinoid receptor 1
Synonyms:
CANN6 CB-R CNR CNR1_HUMAN Cannabinoid receptor Cannabinoid receptor 1 (brain)
Type:
G Protein-Coupled Receptor (GPCR)
Mol. Mass.:
52868.96
Organism:
Homo sapiens (Human)
Description:
P21554
Residue:
472
  
Inhibitor
Name:
BDBM50175130
Synonyms:
(E)-N-(3,5-dimethoxyphenethyl)undec-2-enamide | CHEMBL373056
Type:
Small organic molecule
Emp. Form.:
C21H33NO3
Mol. Mass.:
347.4916
SMILES:
CCCCCCCC\C=C\C(=O)NCCc1cc(OC)cc(OC)c1
: