Target
Cannabinoid receptor 1
Ligand
BDBM50175105
Substrate
Meas. Tech.
ChEMBL_328732 (CHEMBL863907)
Ki
2400±n/a nM
Citation
 Urbani, PCavallo, PCascio, MGBuonerba, MDe Martino, GDi Marzo, VSaturnino, C New metabolically stable fatty acid amide ligands of cannabinoid receptors: Synthesis and receptor affinity studies. Bioorg Med Chem Lett 16:138-41 (2005)  
Target
Name:
Cannabinoid receptor 1
Synonyms:
CANN6 CB-R CNR CNR1_HUMAN Cannabinoid receptor Cannabinoid receptor 1 (brain)
Type:
G Protein-Coupled Receptor (GPCR)
Mol. Mass.:
52868.96
Organism:
Homo sapiens (Human)
Description:
P21554
Residue:
472
  
Inhibitor
Name:
BDBM50175105
Synonyms:
(5Z,8Z,11Z,14Z)-N-(4-methoxyphenethyl)icosa-5,8,11,14-tetraenamide CHEMBL371881
Type:
Small organic molecule
Emp. Form.:
C29H43NO2
Mol. Mass.:
437.6572
SMILES:
CCCCC\C=C/C\C=C/C\C=C/C\C=C/CCCC(=O)NCCc1ccc(OC)cc1
: