Target
Cannabinoid receptor 2
Ligand
BDBM50175138
Substrate
Meas. Tech.
ChEMBL_328733 (CHEMBL863908)
Ki
4100±n/a nM
Citation
 Urbani, PCavallo, PCascio, MGBuonerba, MDe Martino, GDi Marzo, VSaturnino, C New metabolically stable fatty acid amide ligands of cannabinoid receptors: Synthesis and receptor affinity studies. Bioorg Med Chem Lett 16:138-41 (2005)  
Target
Name:
Cannabinoid receptor 2
Synonyms:
CANNABINOID CB2 CB2 CB2B CNR2_HUMAN Cannabinoid CB2 receptor Cannabinoid receptor 2 (CB2R) | hCB2
Type:
G Protein-Coupled Receptor (GPCR)
Mol. Mass.:
39690.94
Organism:
Homo sapiens (Human)
Description:
P34972
Residue:
360
  
Inhibitor
Name:
BDBM50175138
Synonyms:
(5Z,8Z,11Z,14Z)-N-(2,5-dimethoxybenzyl)icosa-5,8,11,14-tetraenamide | CHEMBL381634
Type:
Small organic molecule
Emp. Form.:
C29H43NO3
Mol. Mass.:
453.6566
SMILES:
CCCCC\C=C/C\C=C/C\C=C/C\C=C/CCCC(=O)NCc1cc(OC)ccc1OC
: