Target
Metabotropic glutamate receptor 1
Ligand
BDBM50007548
Substrate
Meas. Tech.
ChEMBL_329050 (CHEMBL863005)
EC50
>1000000±n/a nM
Citation
 Amori, LSerpi, MMarinozzi, MCostantino, GDiaz, MGHermit, MBThomsen, CPellicciari, R Synthesis and preliminary biological evaluation of (2S,1'R,2'S)- and (2S,1'S,2'R)-2-(2'-phosphonocyclopropyl)glycines, two novel conformationally constrained l-AP4 analogues. Bioorg Med Chem Lett 16:196-9 (2005)  
Target
Name:
Metabotropic glutamate receptor 1
Synonyms:
GRM1_RAT Grm1 Metabotropic glutamate receptor Mglur1 metabotropic glutamate 1/5-D metabotropic glutamate receptor 1 isoform alpha precursor
Type:
Enzyme Catalytic Domain
Mol. Mass.:
133240.47
Organism:
RAT
Description:
metabotropic glutamate 1/2 0 RAT::P23385
Residue:
1199
  
Inhibitor
Name:
BDBM50007548
Synonyms:
(S)-2-Amino-4-phosphono-butyric acid 2-Amino-3-(3,5-dioxo-[1,2,4]oxadiazolidin-2-yl)-propionic acid 2-Amino-4-phosphono-butyric acid(S-AP4) 2-amino-4-phosphonobutyric acid L-(+)-2-amino-4-phosphonobutyric acid L-AP4 | L-APB
Type:
Small organic molecule
Emp. Form.:
C4H10NO5P
Mol. Mass.:
183.0997
SMILES:
N[C@@H](CCP(O)(O)=O)C(O)=O
: