Target
Metabotropic glutamate receptor 8
Ligand
BDBM50007548
Substrate
Meas. Tech.
ChEMBL_329057 (CHEMBL863306)
Ki
1900±n/a nM
Citation
 Amori, LSerpi, MMarinozzi, MCostantino, GDiaz, MGHermit, MBThomsen, CPellicciari, R Synthesis and preliminary biological evaluation of (2S,1'R,2'S)- and (2S,1'S,2'R)-2-(2'-phosphonocyclopropyl)glycines, two novel conformationally constrained l-AP4 analogues. Bioorg Med Chem Lett 16:196-9 (2005)  
Target
Name:
Metabotropic glutamate receptor 8
Synonyms:
GRM8_RAT Grm8 Metabotropic glutamate receptor 8 (mGlu8) glutamate receptor, metabotropic 8 precursor metabotropic glutamate 8
Type:
Enzyme
Mol. Mass.:
101886.18
Organism:
Rattus norvegicus (Rat)
Description:
P70579
Residue:
908
  
Inhibitor
Name:
BDBM50007548
Synonyms:
(S)-2-Amino-4-phosphono-butyric acid 2-Amino-3-(3,5-dioxo-[1,2,4]oxadiazolidin-2-yl)-propionic acid 2-Amino-4-phosphono-butyric acid(S-AP4) 2-amino-4-phosphonobutyric acid L-(+)-2-amino-4-phosphonobutyric acid L-AP4 | L-APB
Type:
Small organic molecule
Emp. Form.:
C4H10NO5P
Mol. Mass.:
183.0997
SMILES:
N[C@@H](CCP(O)(O)=O)C(O)=O
: