Target
Metabotropic glutamate receptor 6
Ligand
BDBM50175072
Substrate
Meas. Tech.
ChEMBL_329054 (CHEMBL863302)
EC50
13000±n/a nM
Citation
 Amori, LSerpi, MMarinozzi, MCostantino, GDiaz, MGHermit, MBThomsen, CPellicciari, R Synthesis and preliminary biological evaluation of (2S,1'R,2'S)- and (2S,1'S,2'R)-2-(2'-phosphonocyclopropyl)glycines, two novel conformationally constrained l-AP4 analogues. Bioorg Med Chem Lett 16:196-9 (2005)  
Target
Name:
Metabotropic glutamate receptor 6
Synonyms:
GRM6_RAT Grm6 Metabotropic glutamate receptor 6 (mGlu6) mGlu6 | metabotropic glutamate 6
Type:
Enzyme
Mol. Mass.:
95095.82
Organism:
Rattus norvegicus (Rat)
Description:
P35349
Residue:
871
  
Inhibitor
Name:
BDBM50175072
Synonyms:
(S)-2-amino-2-((1R,2S)-2-phosphonocyclopropyl)acetic acid | CHEMBL197976
Type:
Small organic molecule
Emp. Form.:
C5H10NO5P
Mol. Mass.:
195.1104
SMILES:
N[C@@H]([C@H]1C[C@@H]1P(O)(O)=O)C(O)=O
: