Target
Beta-2 adrenergic receptor
Ligand
BDBM50005833
Substrate
Meas. Tech.
ChEMBL_332087 (CHEMBL858809)
IC50
>10000±n/a nM
Citation
 Becker, DPFlynn, DLMoormann, AENosal, RVillamil, CILoeffler, RGullikson, GWMoummi, CYang, DC Pyrrolizidine esters and amides as 5-HT4 receptor agonists and antagonists. J Med Chem 49:1125-39 (2006)  
Target
Name:
Beta-2 adrenergic receptor
Synonyms:
ADRB2 ADRB2_HUMAN Beta-2 adrenoceptor | Beta-2 adrenoreceptor
Type:
Mol. Mass.:
46461.69
Organism:
Homo sapiens (Human)
Description:
P07550
Residue:
413
  
Inhibitor
Name:
BDBM50005833
Synonyms:
(exo)4-Amino-5-chloro-N-(hexahydro-pyrrolizin-1-ylmethyl)-2-methoxy-benzamide 4-Amino-5-chloro-N-(hexahydro-pyrrolizin-2-ylmethyl)-2-methoxy-benzamide 4-amino-5-chloro-N-[(1S-cis-hexahydro-1H-pyrrolizin-1-yl)-methyl]-2-methoxybenzenecarboxamide SC-53116 SC53116
Type:
Small organic molecule
Emp. Form.:
C16H22ClN3O2
Mol. Mass.:
323.818
SMILES:
COc1cc(N)c(Cl)cc1C(=O)NC[C@@H]1CCN2CCC[C@@H]12
: