Target
Adenosine receptor A2a
Ligand
BDBM50182966
Substrate
Meas. Tech.
ChEMBL_350236 (CHEMBL861496)
Ki
321±n/a nM
Citation
 Zhu, RFrazier, CRLinden, JMacdonald, TL N6-ethyl-2-alkynyl NECAs, selective human A3 adenosine receptor agonists. Bioorg Med Chem Lett 16:2416-8 (2006)  
Target
Name:
Adenosine receptor A2a
Synonyms:
A2A adenosine receptor (hA2A) ADENOSINE A2 ADORA2 Adenosine A2A receptor (A2AAR)
Type:
G Protein-Coupled Receptor (GPCR)
Mol. Mass.:
44716.46
Organism:
Homo sapiens (Human)
Description:
P29274
Residue:
412
  
Inhibitor
Name:
BDBM50182966
Synonyms:
(2S,3S,4R,5R)-N-ethyl-5-(6-(ethylamino)-2-(5-phenylpent-1-ynyl)-9H-purin-9-yl)-3,4-dihydroxy-tetrahydrofuran-2-carboxamide | CHEMBL208311
Type:
Small organic molecule
Emp. Form.:
C25H30N6O4
Mol. Mass.:
478.5435
SMILES:
CCNC(=O)[C@H]1O[C@H]([C@H](O)[C@@H]1O)n1cnc2c(NCC)nc(nc12)C#CCCCc1ccccc1
: