Target
Adenosine receptor A3
Ligand
BDBM50182966
Substrate
Meas. Tech.
ChEMBL_350240 (CHEMBL861501)
Ki
2.42±n/a nM
Citation
 Zhu, RFrazier, CRLinden, JMacdonald, TL N6-ethyl-2-alkynyl NECAs, selective human A3 adenosine receptor agonists. Bioorg Med Chem Lett 16:2416-8 (2006)  
Target
Name:
Adenosine receptor A3
Synonyms:
A3 adenosine receptor (hA3) ADORA3 | Adenosine A3 receptor (A3AR)
Type:
G Protein-Coupled Receptor (GPCR)
Mol. Mass.:
36197.32
Organism:
Homo sapiens (Human)
Description:
P0DMS8
Residue:
318
  
Inhibitor
Name:
BDBM50182966
Synonyms:
(2S,3S,4R,5R)-N-ethyl-5-(6-(ethylamino)-2-(5-phenylpent-1-ynyl)-9H-purin-9-yl)-3,4-dihydroxy-tetrahydrofuran-2-carboxamide | CHEMBL208311
Type:
Small organic molecule
Emp. Form.:
C25H30N6O4
Mol. Mass.:
478.5435
SMILES:
CCNC(=O)[C@H]1O[C@H]([C@H](O)[C@@H]1O)n1cnc2c(NCC)nc(nc12)C#CCCCc1ccccc1
: