Target
Carbonic anhydrase 7
Ligand
BDBM26997
Substrate
Meas. Tech.
ChEMBL_360972 (CHEMBL860093)
Ki
12500±n/a nM
Citation
 Vullo, DRuusuvuori, EKaila, KScozzafava, ASupuran, CT Carbonic anhydrase inhibitors: inhibition of the cytosolic human isozyme VII with anions. Bioorg Med Chem Lett 16:3139-43 (2006)  
Target
Name:
Carbonic anhydrase 7
Synonyms:
CA-VII CAH7_HUMAN Carbonic anhydrase Carbonic anhydrase VII (CA VII)
Type:
Enzyme
Mol. Mass.:
29664.11
Organism:
Homo sapiens (Human)
Description:
Human cloned isozyme.
Residue:
264
  
Inhibitor
Name:
BDBM26997
Synonyms:
CHEMBL364571 benzenarsonic acid phenylarsonic acid
Type:
Emp. Form.:
C6H7AsO3
Mol. Mass.:
202.0396
SMILES:
O[As](O)(=O)c1ccccc1
: