Target
Heat shock protein HSP 90-alpha/90-beta
Ligand
BDBM50191365
Substrate
Meas. Tech.
ChEMBL_365495 (CHEMBL867911)
EC50
585±n/a nM
Citation
 Ge, JNormant, EPorter, JRAli, JADembski, MSGao, YGeorges, ATGrenier, LPak, RHPatterson, JSydor, JRTibbitts, TTTong, JKAdams, JPalombella, VJ Design, synthesis, and biological evaluation of hydroquinone derivatives of 17-amino-17-demethoxygeldanamycin as potent, water-soluble inhibitors of Hsp90. J Med Chem 49:4606-15 (2006)  
Target
Name:
Heat shock protein HSP 90-alpha/90-beta
Synonyms:
Heat Shock Protein 90 (Hsp90) Heat shock protein HSP90
Type:
Mol. Mass.:
Description:
ASSAY_ID of EBI is 29664
Components:
This complex has 2 components.
Component 1
Name:
Heat shock protein HSP 90-alpha
Synonyms:
HS90A_HUMAN HSP86 HSP90AA1 HSPCA Heat shock 86 kDa Heat shock protein HSP 90-alpha (HSP90) LAP-2 Lipopolysaccharide-associated protein 2 heat shock protein 90kDa alpha (cytosolic), class A member 1 isoform 2
Type:
Molecular Chaperone
Mol. Mass.:
84623.45
Organism:
Homo sapiens (Human)
Description:
P07900
Residue:
732
  
Component 2
Name:
Heat shock protein HSP 90-beta
Synonyms:
HS90B_HUMAN HSP 90 HSP90B HSPCB Heat shock protein HSP 90 (Hsp90)
Type:
Molecular Chaperone
Mol. Mass.:
83229.45
Organism:
Homo sapiens (Human)
Description:
P08238
Residue:
724
  
Inhibitor
Name:
BDBM50191365
Synonyms:
Allyl-((12E,16Z,18E)-(7R,9S,10R,11S,14S,15S)-14-carbamoyloxy-3,10-dihydroxy-9,15-dimethoxy-7,11,13,19-tetramethyl-21-oxa-23-aza-tricyclo[18.2.1.0*5,22*]tricosa-1,3,5(22),12,16,18,20(23)-heptaen-4-yl)-ammonium chloride | CHEMBL377782
Type:
Small organic molecule
Emp. Form.:
C31H44N3O7
Mol. Mass.:
570.6964
SMILES:
CO[C@H]1C[C@H](C)Cc2c([NH2+]CC=C)c(O)cc3nc(oc23)C(C)=CC=C[C@H](OC)[C@@H](OC(N)=O)\C(C)=C\[C@H](C)[C@H]1O
: