Target
Mu-type opioid receptor
Ligand
BDBM50266025
Substrate
Meas. Tech.
ChEMBL_366645 (CHEMBL865967)
Ki
0.160000±n/a nM
Citation
 Ballet, SSalvadori, STrapella, CBryant, SDJinsmaa, YLazarus, LHNegri, LGiannini, ELattanzi, RTourwé, DBalboni, G New 2',6'-dimethyl-L-tyrosine (Dmt) opioid peptidomimetics based on the Aba-Gly scaffold. Development of unique mu-opioid receptor ligands. J Med Chem 49:3990-3 (2006)  
Target
Name:
Mu-type opioid receptor
Synonyms:
M-OR-1 MOR-1 MUOR1 Mu opiate receptor OPRM1 hMOP | mu-type opioid receptor isoform MOR-1
Type:
G Protein-Coupled Receptor (GPCR)
Mol. Mass.:
44789.51
Organism:
Homo sapiens (Human)
Description:
P35372
Residue:
400
  
Inhibitor
Name:
BDBM50266025
Synonyms:
(S)-2-((S)-2-amino-3-(4-hydroxy-2,6-dimethylphenyl)propanoyl)-N-(2-(benzylamino)-2-oxoethyl)-1,2,3,4-tetrahydroisoquinoline-3-carboxamide CHEMBL458631 H-Dmt-Tic-Gly-NH-CH2-Ph
Type:
Small organic molecule
Emp. Form.:
C30H34N4O4
Mol. Mass.:
514.6154
SMILES:
Cc1cc(O)cc(C)c1C[C@H](N)C(=O)N1Cc2ccccc2C[C@H]1C(=O)NCC(=O)NCc1ccccc1
: