Target
Mu-type opioid receptor
Ligand
BDBM50189921
Substrate
Meas. Tech.
ChEMBL_366645 (CHEMBL865967)
Ki
1.5±n/a nM
Citation
 Ballet, SSalvadori, STrapella, CBryant, SDJinsmaa, YLazarus, LHNegri, LGiannini, ELattanzi, RTourwé, DBalboni, G New 2',6'-dimethyl-L-tyrosine (Dmt) opioid peptidomimetics based on the Aba-Gly scaffold. Development of unique mu-opioid receptor ligands. J Med Chem 49:3990-3 (2006)  
Target
Name:
Mu-type opioid receptor
Synonyms:
M-OR-1 MOR-1 MUOR1 Mu opiate receptor OPRM1 hMOP | mu-type opioid receptor isoform MOR-1
Type:
G Protein-Coupled Receptor (GPCR)
Mol. Mass.:
44789.51
Organism:
Homo sapiens (Human)
Description:
P35372
Residue:
400
  
Inhibitor
Name:
BDBM50189921
Synonyms:
CHEMBL377392 | H-Dmt-Aba-Gly-NH-Ph
Type:
Small organic molecule
Emp. Form.:
C29H32N4O4
Mol. Mass.:
500.5888
SMILES:
Cc1cc(O)cc(C)c1C[C@H](N)C(=O)N[C@H]1Cc2ccccc2CN(CC(=O)Nc2ccccc2)C1=O
: