Target
Extracellular calcium-sensing receptor
Ligand
BDBM50161093
Substrate
Meas. Tech.
ChEMBL_382280 (CHEMBL866784)
IC50
460±n/a nM
Citation
 Kessler, AFaure, HPetrel, CRognan, DCésario, MRuat, MDauban, PDodd, RH N1-Benzoyl-N2-[1-(1-naphthyl)ethyl]-trans-1,2-diaminocyclohexanes: Development of 4-chlorophenylcarboxamide (calhex 231) as a new calcium sensing receptor ligand demonstrating potent calcilytic activity. J Med Chem 49:5119-28 (2006)  
Target
Name:
Extracellular calcium-sensing receptor
Synonyms:
CASR_RAT Casr Parathyroid Cell calcium-sensing receptor | Pcar1
Type:
PROTEIN
Mol. Mass.:
120858.46
Organism:
Rattus norvegicus
Description:
ChEMBL_750426
Residue:
1079
  
Inhibitor
Name:
BDBM50161093
Synonyms:
(R)-2-chloro-6-(2-hydroxy-3-(2-methyl-1-(naphthalen-2-yl)propan-2-ylamino)propoxy)benzonitrile 2-Chloro-6-[(R)-3-(1,1-dimethyl-2-naphthalen-2-yl-ethylamino)-2-hydroxy-propoxy]-benzonitrile CHEMBL2112075
Type:
Small organic molecule
Emp. Form.:
C24H25ClN2O2
Mol. Mass.:
408.921
SMILES:
CC(C)(Cc1ccc2ccccc2c1)NC[C@@H](O)COc1cccc(Cl)c1C#N
: