Target
Metabotropic glutamate receptor 5
Ligand
BDBM50191146
Substrate
Meas. Tech.
ChEMBL_397503 (CHEMBL864285)
IC50
83±n/a nM
Citation
 Bach, PNilsson, KWållberg, ABauer, UHammerland, LGPeterson, ASvensson, TOsterlund, KKaris, DBoije, MWensbo, D A new series of pyridinyl-alkynes as antagonists of the metabotropic glutamate receptor 5 (mGluR5). Bioorg Med Chem Lett 16:4792-5 (2006)  
Target
Name:
Metabotropic glutamate receptor 5
Synonyms:
GPRC1E GRM5_HUMAN metabotropic glutamate 5 | metabotropic glutamate 5a
Type:
Enzyme
Mol. Mass.:
132484.72
Organism:
Homo sapiens (Human)
Description:
Residue:
1212
  
Inhibitor
Name:
BDBM50191146
Synonyms:
2-(3-(4-isopropylphenoxy)prop-1-ynyl)-6-methylpyridine | CHEMBL215957
Type:
Small organic molecule
Emp. Form.:
C18H19NO
Mol. Mass.:
265.3496
SMILES:
CC(C)c1ccc(OCC#Cc2cccc(C)n2)cc1
: