Target
Motilin receptor
Ligand
BDBM50199357
Substrate
Meas. Tech.
ChEMBL_411464 (CHEMBL853861)
Ki
6064±n/a nM
Citation
 Marsault, EHoveyda, HRPeterson, MLSaint-Louis, CLandry, AVézina, MOuellet, LWang, ZRamaseshan, MBeaubien, SBenakli, KBeauchemin, SDéziel, RPeeters, TFraser, GL Discovery of a new class of macrocyclic antagonists to the human motilin receptor. J Med Chem 49:7190-7 (2006)  
Target
Name:
Motilin receptor
Synonyms:
G-protein coupled receptor 38 MLNR MTLR1 | MTLR_HUMAN
Type:
PROTEIN
Mol. Mass.:
45365.95
Organism:
Homo sapiens (Human)
Description:
ChEMBL_122664
Residue:
412
  
Inhibitor
Name:
BDBM50199357
Synonyms:
(9S,12R,15R)-15-(4-hydroxy-benzyl)-12-isopropyl-9-propyl-6,7,9,10,12,13,15,16,17,18,19,20-dodecahydro-5H-7,10,13,16-tetraaza-benzocyclooctadecene-8,11,14-trione | CHEMBL215963
Type:
Small organic molecule
Emp. Form.:
C31H44N4O4
Mol. Mass.:
536.7055
SMILES:
CCC[C@@H]1NC(=O)[C@H](NC(=O)[C@@H](Cc2ccc(O)cc2)NCCCCc2ccccc2CCNC1=O)C(C)C
: