Target
Cannabinoid receptor 1
Ligand
BDBM50200160
Substrate
Meas. Tech.
ChEMBL_422555 (CHEMBL911052)
Ki
4500±n/a nM
Citation
 Murineddu, GLazzari, PRuiu, SSanna, ALoriga, GManca, IFalzoi, MDessì, CCurzu, MMChelucci, GPani, LPinna, GA Tricyclic pyrazoles. 4. Synthesis and biological evaluation of analogues of the robust and selective CB2 cannabinoid ligand 1-(2',4'-dichlorophenyl)-6-methyl-N-piperidin-1-yl-1,4-dihydroindeno[1,2-c]pyrazole-3-carboxamide. J Med Chem 49:7502-12 (2006)  
Target
Name:
Cannabinoid receptor 1
Synonyms:
Brain-type cannabinoid receptor CB-R CNR1_MOUSE Cannabinoid receptor | Cnr1
Type:
Enzyme
Mol. Mass.:
52842.52
Organism:
Mus musculus (Mouse)
Description:
P47746
Residue:
473
  
Inhibitor
Name:
BDBM50200160
Synonyms:
1-(2',4'-dichlorphenyl)-6-methyl-N-p-nitrophenyl-1,4-dihydroindeno[1,2-c]pyrazole-3-carbohydrazide | CHEMBL216335
Type:
Small organic molecule
Emp. Form.:
C24H17Cl2N5O3
Mol. Mass.:
494.329
SMILES:
Cc1ccc-2c(Cc3c(nn(c-23)-c2ccc(Cl)cc2Cl)C(=O)NNc2ccc(cc2)[N+]([O-])=O)c1
: