Target
Cannabinoid receptor 1
Ligand
BDBM50200168
Substrate
Meas. Tech.
ChEMBL_422555 (CHEMBL911052)
Ki
916±n/a nM
Citation
 Murineddu, GLazzari, PRuiu, SSanna, ALoriga, GManca, IFalzoi, MDessì, CCurzu, MMChelucci, GPani, LPinna, GA Tricyclic pyrazoles. 4. Synthesis and biological evaluation of analogues of the robust and selective CB2 cannabinoid ligand 1-(2',4'-dichlorophenyl)-6-methyl-N-piperidin-1-yl-1,4-dihydroindeno[1,2-c]pyrazole-3-carboxamide. J Med Chem 49:7502-12 (2006)  
Target
Name:
Cannabinoid receptor 1
Synonyms:
Brain-type cannabinoid receptor CB-R CNR1_MOUSE Cannabinoid receptor | Cnr1
Type:
Enzyme
Mol. Mass.:
52842.52
Organism:
Mus musculus (Mouse)
Description:
P47746
Residue:
473
  
Inhibitor
Name:
BDBM50200168
Synonyms:
7-chloro-1-(2',4'-dichlorophenyl)-6-methyl-N-piperidin-1-yl-1,4-dihydroindeno[1,2-c]pyrazole-3-carboxamide | CHEMBL386644
Type:
Small organic molecule
Emp. Form.:
C23H21Cl3N4O
Mol. Mass.:
475.798
SMILES:
Cc1cc2Cc3c(nn(c3-c2cc1Cl)-c1ccc(Cl)cc1Cl)C(=O)NN1CCCCC1
: