Target
Cannabinoid receptor 2
Ligand
BDBM50200168
Substrate
Meas. Tech.
ChEMBL_422554 (CHEMBL911053)
Ki
200±n/a nM
Citation
 Murineddu, GLazzari, PRuiu, SSanna, ALoriga, GManca, IFalzoi, MDessì, CCurzu, MMChelucci, GPani, LPinna, GA Tricyclic pyrazoles. 4. Synthesis and biological evaluation of analogues of the robust and selective CB2 cannabinoid ligand 1-(2',4'-dichlorophenyl)-6-methyl-N-piperidin-1-yl-1,4-dihydroindeno[1,2-c]pyrazole-3-carboxamide. J Med Chem 49:7502-12 (2006)  
Target
Name:
Cannabinoid receptor 2
Synonyms:
CANNABINOID CB2 CB2 Cannabinoid CB2 receptor Cannabinoid receptor 2 mCB2
Type:
Enzyme Catalytic Domain
Mol. Mass.:
38220.43
Organism:
MOUSE
Description:
P47936
Residue:
347
  
Inhibitor
Name:
BDBM50200168
Synonyms:
7-chloro-1-(2',4'-dichlorophenyl)-6-methyl-N-piperidin-1-yl-1,4-dihydroindeno[1,2-c]pyrazole-3-carboxamide | CHEMBL386644
Type:
Small organic molecule
Emp. Form.:
C23H21Cl3N4O
Mol. Mass.:
475.798
SMILES:
Cc1cc2Cc3c(nn(c3-c2cc1Cl)-c1ccc(Cl)cc1Cl)C(=O)NN1CCCCC1
: