Target
Cannabinoid receptor 2
Ligand
BDBM50200163
Substrate
Meas. Tech.
ChEMBL_422554 (CHEMBL911053)
Ki
33±n/a nM
Citation
 Murineddu, GLazzari, PRuiu, SSanna, ALoriga, GManca, IFalzoi, MDessì, CCurzu, MMChelucci, GPani, LPinna, GA Tricyclic pyrazoles. 4. Synthesis and biological evaluation of analogues of the robust and selective CB2 cannabinoid ligand 1-(2',4'-dichlorophenyl)-6-methyl-N-piperidin-1-yl-1,4-dihydroindeno[1,2-c]pyrazole-3-carboxamide. J Med Chem 49:7502-12 (2006)  
Target
Name:
Cannabinoid receptor 2
Synonyms:
CANNABINOID CB2 CB2 Cannabinoid CB2 receptor Cannabinoid receptor 2 mCB2
Type:
Enzyme Catalytic Domain
Mol. Mass.:
38220.43
Organism:
MOUSE
Description:
P47936
Residue:
347
  
Inhibitor
Name:
BDBM50200163
Synonyms:
1-(2',4'-dichlorophenyl)-6-methyl-N-phenyl-1,4-dihydroindeno-[1,2-c]pyrazole-3-carboxamide | CHEMBL385268
Type:
Small organic molecule
Emp. Form.:
C24H17Cl2N3O
Mol. Mass.:
434.317
SMILES:
Cc1ccc-2c(Cc3c(nn(c-23)-c2ccc(Cl)cc2Cl)C(=O)Nc2ccccc2)c1
: