Target
P-selectin
Ligand
BDBM50324667
Substrate
Meas. Tech.
ChEMBL_428317 (CHEMBL917095)
IC50
95000±n/a nM
Citation
 Kranich, RBusemann, ASBock, DSchroeter-Maas, SBeyer, DHeinemann, BMeyer, MSchierhorn, KZahlten, RWolff, GAydt, EM Rational design of novel, potent small molecule pan-selectin antagonists. J Med Chem 50:1101-15 (2007)  
Target
Name:
P-selectin
Synonyms:
GMRP LYAM3_HUMAN P-selectin/P-selectin glycoprotein ligand 1 | SELP
Type:
PROTEIN
Mol. Mass.:
90834.61
Organism:
Homo sapiens (Human)
Description:
ChEMBL_1438999
Residue:
830
  
Inhibitor
Name:
BDBM50324667
Synonyms:
1,6-bis[3-(3-carboxymethylphenyl)-4-(2-R-D-mannopyranosyloxy)phenyl]hexane TBC-1269
Type:
Small organic molecule
Emp. Form.:
C46H54O16
Mol. Mass.:
862.9114
SMILES:
OC[C@H]1O[C@H](Oc2ccc(CCCCCCc3ccc(O[C@H]4O[C@H](CO)[C@@H](O)[C@H](O)[C@@H]4O)c(c3)-c3cccc(CC(O)=O)c3)cc2-c2cccc(CC(O)=O)c2)[C@@H](O)[C@@H](O)[C@@H]1O
: