Target
Sodium-dependent dopamine transporter
Ligand
BDBM50209490
Substrate
Meas. Tech.
ChEMBL_443548 (CHEMBL893805)
Ki
13±n/a nM
Citation
 Loriga, GRuiu, SManca, IMurineddu, GDessi, CPani, LPinna, GA 3-{2-[Bis-(4-fluorophenyl)methoxy]ethyl}-6-substituted-3,6-diazabicyclo[3.1.1]heptanes as novel potent dopamine uptake inhibitors. Bioorg Med Chem 15:3748-55 (2007)  
Target
Name:
Sodium-dependent dopamine transporter
Synonyms:
DA transporter SC6A3_RAT Sodium-dependent dopamine transporter | Sodium-dependent dopamine transporter (DAT)
Type:
Multi-pass membrane protein
Mol. Mass.:
68749.45
Organism:
Rattus norvegicus (rat)
Description:
P23977
Residue:
619
  
Inhibitor
Name:
BDBM50209490
Synonyms:
3-{2-[bis-(4-fluorophenyl)methoxy]ethyl}-6-[(E)-3-thiophen-2-ylallyl]-3,6-diazabicyclo[3.1.1]heptane fumarate
Type:
Small organic molecule
Emp. Form.:
C27H28F2N2OS
Mol. Mass.:
466.586
SMILES:
Fc1ccc(cc1)C(OCCN1CC2CC(C1)N2C\C=C\c1cccs1)c1ccc(F)cc1
: