Target
Beta-2 adrenergic receptor
Ligand
BDBM50221767
Substrate
Meas. Tech.
ChEMBL_446237 (CHEMBL895342)
EC50
20000±n/a nM
Citation
 Buonsanti, MFBertinaria, MStilo, ADCena, CFruttero, RGasco, A Nitric oxide donor beta2-agonists: furoxan derivatives containing the fenoterol moiety and related furazans. J Med Chem 50:5003-11 (2007)  
Target
Name:
Beta-2 adrenergic receptor
Synonyms:
ADRB2_RAT Adrb2r | Adrenergic receptor beta
Type:
PROTEIN
Mol. Mass.:
46896.26
Organism:
Rattus norvegicus
Description:
ChEMBL_38603
Residue:
418
  
Inhibitor
Name:
BDBM50221767
Synonyms:
5-(1-hydroxy-2-{1-methyl-2-[4-(4-methyl-5-oxy-furazan-3-ylmethoxy)-phenyl]-ethylamino}-ethyl)-benzene-1,3-diol | CHEMBL395082
Type:
Small organic molecule
Emp. Form.:
C21H25N3O6
Mol. Mass.:
415.4397
SMILES:
CC(Cc1ccc(OCc2no[n+]([O-])c2C)cc1)NCC(O)c1cc(O)cc(O)c1
: