Target
Beta-2 adrenergic receptor
Ligand
BDBM50156304
Substrate
Meas. Tech.
ChEMBL_446228 (CHEMBL895333)
EC50
2200±n/a nM
Citation
 Buonsanti, MFBertinaria, MStilo, ADCena, CFruttero, RGasco, A Nitric oxide donor beta2-agonists: furoxan derivatives containing the fenoterol moiety and related furazans. J Med Chem 50:5003-11 (2007)  
Target
Name:
Beta-2 adrenergic receptor
Synonyms:
ADRB2_CAVPO adrenergic Beta2
Type:
Enzyme Catalytic Domain
Mol. Mass.:
46993.24
Organism:
GUINEA PIG
Description:
adrenergic Beta2 ADRB2 GUINEA PIG::Q8K4Z4
Residue:
418
  
Inhibitor
Name:
BDBM50156304
Synonyms:
3-benzenesulfonyl-4-ethoxy-furazan 2-oxide 4-ethoxy-3-phenylsulfonylfuroxan | CHEMBL363325
Type:
Small organic molecule
Emp. Form.:
C10H10N2O5S
Mol. Mass.:
270.262
SMILES:
CCOc1no[n+]([O-])c1S(=O)(=O)c1ccccc1
: