Target
Growth hormone secretagogue receptor type 1
Ligand
BDBM50222863
Substrate
Meas. Tech.
ChEMBL_446527 (CHEMBL895698)
Ki
2.5±n/a nM
Citation
 Rudolph, JEsler, WPO'connor, SCoish, PDWickens, PLBrands, MBierer, DEBloomquist, BTBondar, GChen, LChuang, CYClaus, THFathi, ZFu, WKhire, URKristie, JALiu, XGLowe, DBMcClure, ACMichels, MOrtiz, AARamsden, PDSchoenleber, RWShelekhin, TEVakalopoulos, ATang, WWang, LYi, LGardell, SJLivingston, JNSweet, LJBullock, WH Quinazolinone derivatives as orally available ghrelin receptor antagonists for the treatment of diabetes and obesity. J Med Chem 50:5202-16 (2007)  
Target
Name:
Growth hormone secretagogue receptor type 1
Synonyms:
Ghrelin receptor
Type:
PROTEIN
Mol. Mass.:
41494.35
Organism:
Ovis aries
Description:
ChEMBL_446527
Residue:
366
  
Inhibitor
Name:
BDBM50222863
Synonyms:
6-(4-chlorophenyl)-3-[(1-cyclobutylpiperidin-3-yl)methyl]-2-(2-methylphenyl)quinazolin-4(3H)-one | CHEMBL243886
Type:
Small organic molecule
Emp. Form.:
C31H32ClN3O
Mol. Mass.:
498.058
SMILES:
Cc1ccccc1-c1nc2ccc(cc2c(=O)n1CC1CCCN(C1)C1CCC1)-c1ccc(Cl)cc1
: