Target
11-beta-hydroxysteroid dehydrogenase 1
Ligand
BDBM50212527
Substrate
Meas. Tech.
ChEMBL_455776 (CHEMBL887782)
IC50
25000±n/a nM
Citation
 Xiang, JIpek, MSuri, VTam, MXing, YHuang, NZhang, YTobin, JMansour, TSMcKew, J beta-Keto sulfones as inhibitors of 11beta-hydroxysteroid dehydrogenase type I and the mechanism of action. Bioorg Med Chem 15:4396-405 (2007)  
Target
Name:
11-beta-hydroxysteroid dehydrogenase 1
Synonyms:
11-DH 11-beta-Hydroxysteroid Dehydrogenase 1 (11-beta-HSD1) 11-beta-hydroxysteroid dehydrogenase 1 (11HSD1) Corticosteroid 11-beta-dehydrogenase isozyme 1 (11-beta-HSD-1) Corticosteroid 11-beta-dehydrogenase isozyme 1 (11beta-HSD1) HSD11 HSD11L | SDR26C1
Type:
Enzyme
Mol. Mass.:
32409.16
Organism:
Homo sapiens (Human)
Description:
P28845
Residue:
292
  
Inhibitor
Name:
BDBM50212527
Synonyms:
1-(4-bromophenyl)-3-(phenylsulfonyl)propan-1-one | CHEMBL240504
Type:
Small organic molecule
Emp. Form.:
C15H13BrO3S
Mol. Mass.:
353.231
SMILES:
Brc1ccc(cc1)C(=O)CCS(=O)(=O)c1ccccc1
: