Target
11-beta-hydroxysteroid dehydrogenase type 2
Ligand
BDBM50212534
Substrate
Meas. Tech.
ChEMBL_455777 (CHEMBL887783)
IC50
>200000±n/a nM
Citation
 Xiang, JIpek, MSuri, VTam, MXing, YHuang, NZhang, YTobin, JMansour, TSMcKew, J beta-Keto sulfones as inhibitors of 11beta-hydroxysteroid dehydrogenase type I and the mechanism of action. Bioorg Med Chem 15:4396-405 (2007)  
Target
Name:
11-beta-hydroxysteroid dehydrogenase type 2
Synonyms:
11-DH2 11-beta-Hydroxysteroid Dehydrogenase 2 (11-beta-HSD2) 11-beta-hydroxysteroid dehydrogenase 2 11-beta-hydroxysteroid dehydrogenase type 2 (11-beta-HSD2) DHI2_HUMAN HSD11K SDR9C3
Type:
Enzyme
Mol. Mass.:
44141.72
Organism:
Homo sapiens (Human)
Description:
Purified recombinant human 11beta-HSD2.
Residue:
405
  
Inhibitor
Name:
BDBM50212534
Synonyms:
1-(3-methoxyphenyl)-2-(phenylsulfonyl)ethanone | CHEMBL393079
Type:
Small organic molecule
Emp. Form.:
C15H14O4S
Mol. Mass.:
290.334
SMILES:
COc1cccc(c1)C(=O)CS(=O)(=O)c1ccccc1
: