Target
5-hydroxytryptamine receptor 1A
Ligand
BDBM50202332
Substrate
Meas. Tech.
ChEMBL_461140 (CHEMBL944163)
Ki
41±n/a nM
Citation
 Zhang, AZhang, YBranfman, ARBaldessarini, RJNeumeyer, JL Advances in development of dopaminergic aporphinoids. J Med Chem 50:171-81 (2007)  
Target
Name:
5-hydroxytryptamine receptor 1A
Synonyms:
5-HT-1A 5-HT1A 5-hydroxytryptamine receptor 1A (5HT1A) 5ht1a Htr1a Serotonin 1a (5-HT1a) receptor/Adrenergic receptor alpha-1 | Serotonin receptor 1A
Type:
G Protein-Coupled Receptor (GPCR)
Mol. Mass.:
46445.29
Organism:
Rattus norvegicus (rat)
Description:
Binding assays were performed using rat hippocampal membranes.
Residue:
422
  
Inhibitor
Name:
BDBM50202332
Synonyms:
(R)-5a,6-dimethyl-1,5,5a,6,7,8-hexahydro-6-aza-benzo[mno]aceanthrylene | CHEMBL403844
Type:
Small organic molecule
Emp. Form.:
C19H19N
Mol. Mass.:
261.3609
SMILES:
CN1CCc2ccc3Cc4cccc5C[C@]1(C)c2c3-c45
: