Target
B1 bradykinin receptor
Ligand
BDBM50371643
Substrate
Meas. Tech.
ChEMBL_463823 (CHEMBL948902)
Ki
0.2±n/a nM
Citation
 Feng, DMDiPardo, RMWai, JMChang, RKDi Marco, CNMurphy, KLRansom, RWReiss, DRTang, CPrueksaritanont, TPettibone, DJBock, MGKuduk, SD A new class of bradykinin B1 receptor antagonists with high oral bioavailability and minimal PXR activity. Bioorg Med Chem Lett 18:682-7 (2008)  
Target
Name:
B1 bradykinin receptor
Synonyms:
B1 BRADYKININ B1R BK-1 receptor BRADYB1 | Bradykinin B1 receptor
Type:
Enzyme
Mol. Mass.:
40508.87
Organism:
Homo sapiens (Human)
Description:
P46663
Residue:
353
  
Inhibitor
Name:
BDBM50371643
Synonyms:
CHEMBL272278
Type:
Small organic molecule
Emp. Form.:
C22H18Cl2F6N2O3
Mol. Mass.:
543.286
SMILES:
C[C@@H](NC(=O)C1(CC1)NC(=O)C(F)(F)F)c1ccc(cc1F)-c1cc(Cl)cc(Cl)c1OCC(F)F
: