Target
Adenosine receptor A2a
Ligand
BDBM50372570
Substrate
Meas. Tech.
ChEMBL_465258 (CHEMBL930529)
Ki
2±n/a nM
Citation
 Moorjani, MZhang, XChen, YLin, ERueter, JKGross, RSLanier, MCTellew, JEWilliams, JPLechner, SMMalany, SSantos, MEkhlassi, PCastro-Palomino, JCCrespo, MIPrat, MGual, SDíaz, JLSaunders, JSlee, DH 2,6-Diaryl-4-phenacylaminopyrimidines as potent and selective adenosine A(2A) antagonists with reduced hERG liability. Bioorg Med Chem Lett 18:1269-73 (2008)  
Target
Name:
Adenosine receptor A2a
Synonyms:
A2A adenosine receptor (hA2A) ADENOSINE A2 ADORA2 Adenosine A2A receptor (A2AAR)
Type:
G Protein-Coupled Receptor (GPCR)
Mol. Mass.:
44716.46
Organism:
Homo sapiens (Human)
Description:
P29274
Residue:
412
  
Inhibitor
Name:
BDBM50372570
Synonyms:
CHEMBL404193
Type:
Small organic molecule
Emp. Form.:
C24H25N5O4
Mol. Mass.:
447.4864
SMILES:
COc1ccc(CC(=O)Nc2cc(nc(n2)-c2ccc(C)o2)-n2nc(C)cc2C)cc1OC
: