Target
Cytochrome P450 3A4
Ligand
BDBM50372576
Substrate
Meas. Tech.
ChEMBL_465260 (CHEMBL930528)
IC50
1800±n/a nM
Citation
 Moorjani, MZhang, XChen, YLin, ERueter, JKGross, RSLanier, MCTellew, JEWilliams, JPLechner, SMMalany, SSantos, MEkhlassi, PCastro-Palomino, JCCrespo, MIPrat, MGual, SDíaz, JLSaunders, JSlee, DH 2,6-Diaryl-4-phenacylaminopyrimidines as potent and selective adenosine A(2A) antagonists with reduced hERG liability. Bioorg Med Chem Lett 18:1269-73 (2008)  
Target
Name:
Cytochrome P450 3A4
Synonyms:
Albendazole monooxygenase CP3A4_HUMAN CYP3A4 CYPIIIA4 Cytochrome P450 3A4 (CYP3A4) Nifedipine oxidase Taurochenodeoxycholate 6-alpha-hydroxylase
Type:
Enzyme
Mol. Mass.:
57349.57
Organism:
Homo sapiens (Human)
Description:
Residue:
503
  
Inhibitor
Name:
BDBM50372576
Synonyms:
CHEMBL402071
Type:
Small organic molecule
Emp. Form.:
C23H22N6O2
Mol. Mass.:
414.4598
SMILES:
COc1ccc(CC(=O)Nc2cc(nc(n2)-c2ccccn2)-n2nc(C)cc2C)cc1
: