Target
Potassium voltage-gated channel subfamily H member 2
Ligand
BDBM50372569
Substrate
Meas. Tech.
ChEMBL_465262 (CHEMBL930532)
IC50
>3000±n/a nM
Citation
 Moorjani, MZhang, XChen, YLin, ERueter, JKGross, RSLanier, MCTellew, JEWilliams, JPLechner, SMMalany, SSantos, MEkhlassi, PCastro-Palomino, JCCrespo, MIPrat, MGual, SDíaz, JLSaunders, JSlee, DH 2,6-Diaryl-4-phenacylaminopyrimidines as potent and selective adenosine A(2A) antagonists with reduced hERG liability. Bioorg Med Chem Lett 18:1269-73 (2008)  
Target
Name:
Potassium voltage-gated channel subfamily H member 2
Synonyms:
1,3-beta-glucan synthase component GLS2 ERG Eag-related protein 1 Ether-a-go-go-related gene (HERG) Ether-a-go-go-related gene potassium channel 1 Ether-a-go-go-related gene potassium channel 1 (hERG1) Ether-a-go-go-related protein 1 H-ERG KCNH2 Potassium voltage-gated channel subfamily H member 2 (hERG) Voltage-gated potassium channel subunit Kv11.1 hERG Potassium Channel 1 | putative potassium channel subunit
Type:
Multi-pass membrane protein
Mol. Mass.:
126672.65
Organism:
Homo sapiens (Human)
Description:
Q12809
Residue:
1159
  
Inhibitor
Name:
BDBM50372569
Synonyms:
CHEMBL257670
Type:
Small organic molecule
Emp. Form.:
C24H25N5O4
Mol. Mass.:
447.4864
SMILES:
COc1cc(CC(=O)Nc2cc(nc(n2)-c2ccc(C)o2)-n2nc(C)cc2C)cc(OC)c1
: