Target
Farnesyl pyrophosphate synthase
Ligand
BDBM50372767
Substrate
Meas. Tech.
ChEMBL_465861 (CHEMBL951084)
IC50
>50000±n/a nM
Citation
 Peukert, SSun, YZhang, RHurley, BSabio, MShen, XGray, CDzink-Fox, JTao, JCebula, RWattanasin, S Design and structure-activity relationships of potent and selective inhibitors of undecaprenyl pyrophosphate synthase (UPPS): tetramic, tetronic acids and dihydropyridin-2-ones. Bioorg Med Chem Lett 18:1840-4 (2008)  
Target
Name:
Farnesyl pyrophosphate synthase
Synonyms:
Dimethylallyltranstransferase FPP synthase FPPS_HUMAN Farnesyl diphosphate synthase Farnesyl diphosphate synthetase Farnesyl pyrophosphate synthetase KIAA1293 | P14324
Type:
Enzyme
Mol. Mass.:
48272.89
Organism:
Homo sapiens (Human)
Description:
P14324
Residue:
419
  
Inhibitor
Name:
BDBM50372767
Synonyms:
CHEMBL272913
Type:
Small organic molecule
Emp. Form.:
C19H16F3N3O3
Mol. Mass.:
391.3438
SMILES:
FC(F)(F)c1ccc(NC(=O)C2C(=O)CC(Cc3ccccc3)NC2=O)cn1
: