Target
Cation-independent mannose-6-phosphate receptor
Ligand
BDBM50275807
Substrate
Meas. Tech.
ChEMBL_466588 (CHEMBL930238)
IC50
11500±n/a nM
Citation
 Fei, XConnelly, CMMacDonald, RGBerkowitz, DB A set of phosphatase-inert"molecular rulers" to probe for bivalent mannose 6-phosphate ligand-receptor interactions. Bioorg Med Chem Lett 18:3085-9 (2008)  
Target
Name:
Cation-independent mannose-6-phosphate receptor
Synonyms:
300 kDa mannose 6-phosphate receptor CI-M6PR IGF-II receptor Insulin-like growth factor 2 receptor M6P/IGF2 receptor M6PR MPRI | MPRI_HUMAN
Type:
PROTEIN
Mol. Mass.:
274350.28
Organism:
Homo sapiens (Human)
Description:
ChEMBL_99803
Residue:
2491
  
Inhibitor
Name:
BDBM50275807
Synonyms:
mannose 6-phosphate
Type:
Small organic molecule
Emp. Form.:
C6H12O9P
Mol. Mass.:
259.1284
SMILES:
O[C@H]1O[C@H](COP(O)([O-])=O)[C@@H](O)[C@H](O)[C@@H]1O
: