Target
Glycogen synthase kinase-3 beta
Ligand
BDBM8253
Substrate
Meas. Tech.
ChEMBL_466615 (CHEMBL930273)
IC50
58±n/a nM
Citation
 Taha, MOBustanji, YAl-Ghussein, MAMohammad, MZalloum, HAl-Masri, IMAtallah, N Pharmacophore modeling, quantitative structure-activity relationship analysis, and in silico screening reveal potent glycogen synthase kinase-3beta inhibitory activities for cimetidine, hydroxychloroquine, and gemifloxacin. J Med Chem 51:2062-77 (2008)  
Target
Name:
Glycogen synthase kinase-3 beta
Synonyms:
GSK-3 beta GSK3B Glycogen synthase kinase 3 beta (GSK3B) Glycogen synthase kinase-3 beta (GSK-3B) Glycogen synthase kinase-3 beta (GSK3B) Glycogen synthase kinase-3beta (GSK3B) | Serine/threonine-protein kinase GSK3B
Type:
Enzyme
Mol. Mass.:
46756.38
Organism:
Homo sapiens (Human)
Description:
P49841
Residue:
420
  
Inhibitor
Name:
BDBM8253
Synonyms:
3-(3-chlorophenyl)-4-[(3,5-dichloro-4-hydroxyphenyl)amino]-2,5-dihydro-1H-pyrrole-2,5-dione | 4-arylmaleimide deriv. 6-j
Type:
Small organic molecule
Emp. Form.:
C16H9Cl3N2O3
Mol. Mass.:
383.613
SMILES:
Oc1c(Cl)cc(NC2=C(C(=O)NC2=O)c2cccc(Cl)c2)cc1Cl
: