Target
Muscarinic acetylcholine receptor M5
Ligand
BDBM50403547
Substrate
Meas. Tech.
ChEMBL_468562 (CHEMBL932109)
Ki
1.8±n/a nM
Citation
 Lewis, LMSheffler, DWilliams, RBridges, TMKennedy, JPBrogan, JTMulder, MJWilliams, LNalywajko, NTNiswender, CMWeaver, CDConn, PJLindsley, CW Synthesis and SAR of selective muscarinic acetylcholine receptor subtype 1 (M1 mAChR) antagonists. Bioorg Med Chem Lett 18:885-90 (2008)  
Target
Name:
Muscarinic acetylcholine receptor M5
Synonyms:
ACM5_RAT Chrm-5 Muscarinic acetylcholine receptor | Muscarinic acetylcholine receptor M5
Type:
Enzyme Catalytic Domain
Mol. Mass.:
60161.80
Organism:
RAT
Description:
Cholinergic, muscarinic M5 CHRM5 RAT::P08911
Residue:
531
  
Inhibitor
Name:
BDBM50403547
Synonyms:
ATROPEN | ATROPINE
Type:
Small organic molecule
Emp. Form.:
C17H23NO3
Mol. Mass.:
289.3694
SMILES:
CN1[C@H]2CC[C@@H]1C[C@@H](C2)OC(=O)C(CO)c1ccccc1
: